Search Posts

Gcc 3.4 Stop On First Error

RECOMMENDED: If you have Windows errors then we strongly recommend that you download and run this (Windows) Repair Tool.

4.1.1.5 Times. Times are expressed in four figures, the first two denoting the hour and the last two the minutes, the day starting at midnight with 0000 and ending at.

Win32CompileCygwinOld – VideoLAN Wiki – Aug 14, 2013. So the preferred version to use is GCC 3.4 but for historical reasons this. If it runs for the first time it will automatically create a home"username" folder in. in t)' collect2: ld returned 1 exit status make[2]: *** [vlc.exe] Error 1.

This video will show you how to Resolve iOS update and restore errors. Don't restore it without trying this first! – Duration: 4. 3 Ways To Fix Error.

Fatal Error Asm/types.h No Such File Or Directory May 7, 2014. Error! Bad return status for module build on kernel: 4.11.3-1-ARCH (x86_64). make[1]: Entering directory '/usr/lib/modules/3.14.0-3-ARCH/build'. include/uapi/ linux/types.h:4:23: fatal error: asm/types.h: No such file or. Warning: include(/dom7280/wp-content/advanced-cache.php): failed to open stream: No such file or directory in /wordpress-4.8.2/wp. eval()’d code on line 1 Fatal error: Cannot redeclare func_by_cat_recentpost() (previously. Nov 18, 2014. memfetch.c:30:22: fatal error: asm/page.h: No such file or directory. answer mentions removing asm/page.h and adding linux/types.h. Release 1.3.6 * Ensure locations

“There was a clerical error. containing 3.4 grams of meth and an insulin syringe was found near where his feet were,” she added. Corey L. Hopper, 27, of Lawrenceburg, theft of identity of another without consent, a Class D felony; first.

3/4 of my screen has a pinkish tint to it.so for.example on a white background i.

Just like last season, Ohio State’s first shutout of the season came against the.

PHP 5 ChangeLog Version 5.6.31 06 Jul 2017. Core: Fixed bug #73807 (Performance problem with processing post request over 2000000 chars). Fixed bug #74111 (Heap.

Nov 8, 2014. sudo apt-get install libc6-dev. sudo apt-get install gcc-multilib. Create a symbolic link -. sudo ln -s /usr/lib/x86_64-linux-gnu /usr/lib64.

BSoDs have been present in Windows NT 3.1 (the first. attributed the creation of the Blue Screen of Death. (officially known as a stop error and.

Eytan Modiano 3 Pure Stop and Wait Protocol • Problem: Lost Packets – Sender will wait forever for an acknowledgement • Packet may be lost due to framing errors

You will learn how to create For Loops and While Loops. You can use an "or" function to compare an error wire status and a Stop. whichever happens first. 3.

Stopping Existing Oracle Processes. At the first software selection screen, which lists task-specific software options, error from various Oracle processes and potentially Linux Error EMFILE (Too many. binutils-2.15.92.0.2 compat- libstdc++-33-3.2.3 elfutils-libelf-0.97 elfutils-libelf-devel-0.97 gcc-3.4.6 gcc-c++- 3.4.6.

Tiffin University – Davenport ended their Ohio road trip with a stop at Tiffin University. The Panthers lost to the Dragons 0-3 and are now 3-4 in conference play. gave DU a chance.

Hold the can safely 3-4 feet from the fire and aim. (4) times and stop and number on. Simply follow the instructions on the First Alert website (see FAQ.

Error Desconocido En Outlook Exchangemaster GmbH – your prime Swiss partner for Microsoft Exchange related projects and training. Dec 22, 2010  · Outlook showing send/recieve error 0x800411f4. Outlook shows a send/recieve error in the status. //www.google.com/support/a/bin/answer.py?hl=en. En el Outlook 2010 me sale un mensaje al enviar e-mails "Error en la operacion, se produjo error desconocido en interfaz de mensajes" My Exchange server is 2010 and all the clients that connect to it Windows 7 + Outlook 2010 Pro. Outlook 2010

Cygwin/X is a port of the X Window System to Cygwin. Cygwin provides a UNIX-like API on the Win32 platform.

Xilinx Error Ngdbuild 604 Logical Block ERROR:NgdBuild:604 – logical block – Community Forums – Xilinx.com uses the latest web. ERROR:NgdBuild:604 – logical block 'core_dct_0. I modified the name of this component into dct_ip but the same error. Error Class Info Invalid System Registration Token RHEL system experiences "Error Class Code: 91" when registering or updating. Error Class Info: Registration token. system registration fails with "Error Class. Nikon D5100 Memory Card Error Buy SanDisk 64GB Extreme PRO SDXC UHS-I Memory Card features

RECOMMENDED: Click here to fix Windows errors and improve system performance