Search Posts

Ruby Configure Error C Compiler Cannot Create Executables

Gentoo Tidbits - "C Compiler Cannot Create Executables"

RECOMMENDED: If you have Windows errors then we strongly recommend that you download and run this (Windows) Repair Tool.

I tried to install the Python package dulwich: pip install dulwich But I get a cryptic error message: error: Unable to find vcvarsall.bat The same happens if I try.

Microsoft Visual Basic Runtime Error 4160 Any break in dependencies can cause a runtime error. Java programs require to run. Visual Basic programs also cannot execute natively, using a runtime engine to translate the code into machine language. Similarly, Microsoft’s. Visual Basic run-time errors occur when an application attempts to perform an action that the system cannot execute. Run-time error 4160 when running Word compare in VBA. I'm receiving Run-time error 4160 / Bad file name. VBA Visual Basic for Applications

Dec 8, 2016. We use Node.js, React, Ruby on Rails, Elixir and machine learning. configure: error: C compiler cannot create executables See `config.log'.

May 6, 2011. configure: error: in `/var/tmp/portage/x11-libs/gdk-pixbuf-2.22.1/work/gdk-pixbuf- 2.22.1': configure: error: C compiler cannot create executables

@Page: Defines page-specific attributes used by the ASP.NET page parser and compiler. Can be included only in.aspx files <%@ Page AspCompat="TRUE" language="C#" %>

I've checked a number of similar questions on stackoverflow but haven't found an answer yet. I am trying to build Ruby from source as describe here: https://www.ruby.

I was trying to install rvm using \curl -L https://get.rvm.io | bash -s stable –ruby –autolibs=enable –auto-dotfiles. It worked fine until I got a configure error.

Please refer to the Installation Guide and. RPM 4.0.3. RPM 4.1 cannot install to a non-default directory. This has been resolved in RPM 4.11 to 4.2. Eclipse* Installation and Configuration Notes The 10.0 versions of the Intel C++.

As part of our syndication arrangements with the Siebel Hub team, the following article has been kindly been allowed to be published here. Since a large portion of.

Clarion Connection – outsidetrains.com – The place to find Clarion Resources in one page. Just use the "Edit Find" feature of your browser to search for whatever you’re interested in.

rvm 安装Ruby 1.9.3时错误: compiler cannot create executables. rvm install 1.9. 3 –with-gcc=clang. 原因未知,安装1.9.2没有问题,估计和xcode有关。 标签: rvm.

RPM Guide – Permission is granted to copy, distribute, and/or modify this document under the terms of the Open Publication Licence, Version 1.0, or any later version.

Ruby 2.4.1 Fails to Compile on Raspberry Pi 3, Raspbian. Added by martin_vahi. configure: error: C compiler cannot create executables. It's your compiler.

Excel Vba Catch Specific Error Nov 23, 2016. If you are new to VBA Error Handling, then you can read the post from start to finish. (Only useful if you need to check a specific error occurred.). The heart of error handling in VBA is the On Error. Handling In VBA. Error handling in VB6 and VBA is. structure call Try/Catch that allows much. “Ideas are like seeds and it’s up to you to catch them and grow an idea.

C:winntMicrosoft.NETFrameworkv1.1.4322 This directory contains numerous dlls, configuration files, executables, and more. For this article, I concentrate on the executables. Here’s a rundown of these programs: Al.exe: The.

This should be reported to the ruby-build project, where rbenv install comes from, which handles compiling Rubies. But for now: What's your rbenv install –version

Hi I working on Windows 7 and am trying to install special RUby Binary to make the full use of ruby-prof on rails 3.2. I am following the steps outlined here https.

Wiaacmgr.exe Error How to Fix Wiaacmgr.exe Errors Windows operating system misconfiguration is the main cause of Wiaacmgr.exe error codes Therefore, we strongly suggest using How to Fix Wiaacmgr.exe Parameters Errors Click the Reset button. Therefore, we strongly suggest using the downloadable Wiaacmgr.exe Parameters Repair Kit to fix. Windows errors related to wiaacmgr.exe? wiaacmgr.exe is a process associated with Microsoft® Windows® Operating System from. N/A (Update Drivers). What is wiaacmgr.exe? The genuine wiaacmgr.exe file is a software component

MIT Kerberos for Windows (KfW) is an integrated Kerberos release for Microsoft. the Ticket Initialization dialog may now optionally be preserved. A memory access error introduced in 2.6.1 has been eliminated. This problem was traced.

I get the following error while trying to install Ruby 1.9.3 on Trisquel 6 using the following command rvm install 1.9.3 ERROR Error running './configure –prefix.

Common Weakness Enumeration (CWE) is a list of software weaknesses.

2014年2月11日. rbenvを利用して、rubyのインストールを試みていますが、 ずっと同じエラーが出て. configure: error: C compiler cannot create executables See.

. I appear to have broken my Ruby on Rails development. C compiler cannot create executables. checking whether the C compiler works. no configure: error:.

RECOMMENDED: Click here to fix Windows errors and improve system performance